porridge-n
type: LexicalEntry
canonical form: porridge
sense: 07890756-n
part of speech: noun

07890756-n
type: LexicalConcept
in scheme: en-word.net
definition: soft food made by boiling oatmeal or other meal or legumes in water or milk until thick
ili: i78604
lexfile: noun.food
part of speech: noun
hypernym: 07572999-n
mero substance: 07584067-n