milk-n
type: LexicalEntry
canonical form: milk
sense: 07860580-n
part of speech: noun

07860580-n
type: LexicalConcept
in scheme: en-word.net
definition: any of several nutritive milklike liquids
ili: i78384
lexfile: noun.food
part of speech: noun
hypernym: 07581905-n