milk-n
type: LexicalEntry
canonical form: milk
sense: 07860018-n
part of speech: noun

07860018-n
type: LexicalConcept
in scheme: en-word.net
definition: a white nutritious liquid secreted by mammals and used as food by human beings
ili: i78383
lexfile: noun.food
part of speech: noun
hypernym: 07859751-n
hypernym: 07897775-n
mero substance: 14752903-n