perch-n
type: LexicalEntry
canonical form: perch
sense: 07796149-n
part of speech: noun

07796149-n
type: LexicalConcept
in scheme: en-word.net
definition: any of numerous fishes of America and Europe
ili: i77967
lexfile: noun.food
part of speech: noun
hypernym: 07792521-n