mangosteen-n
type: LexicalEntry
canonical form: mangosteen
sense: 07779963-n
part of speech: noun

07779963-n
type: LexicalConcept
in scheme: en-word.net
definition: two- to three-inch tropical fruit with juicy flesh suggestive of both peaches and pineapples
ili: i77868
lexfile: noun.food
part of speech: noun
hypernym: 07721676-n