ackee-n
type: LexicalEntry
canonical form: ackee
sense: 07778716-n
part of speech: noun

akee-n
type: LexicalEntry
canonical form: akee
sense: 07778716-n
part of speech: noun

07778716-n
type: LexicalConcept
in scheme: en-word.net
definition: red pear-shaped tropical fruit with poisonous seeds; flesh is poisonous when unripe or overripe
ili: i77861
lexfile: noun.food
part of speech: noun
hypernym: 07721676-n