berry-n
type: LexicalEntry
canonical form: berry
sense: 07758680-n
part of speech: noun

07758680-n
type: LexicalConcept
in scheme: en-word.net
definition: any of numerous small and pulpy edible fruits; used as desserts or in making jams and jellies and preserves
ili: i77735
lexfile: noun.food
part of speech: noun
hypernym: 07721676-n