sorrel-n
type: LexicalEntry
canonical form: sorrel
sense: 07752347-n
part of speech: noun

common sorrel-n
type: LexicalEntry
canonical form: common sorrel
sense: 07752347-n
part of speech: noun

07752347-n
type: LexicalConcept
in scheme: en-word.net
definition: large sour-tasting arrowhead-shaped leaves used in salads and sauces
ili: i77692
lexfile: noun.food
part of speech: noun
hypernym: 07725078-n