coffee substitute-n
type: LexicalEntry
canonical form: coffee substitute
sense: 07747098-n
part of speech: noun

07747098-n
type: LexicalConcept
in scheme: en-word.net
definition: a drink resembling coffee that is sometimes substituted for it
ili: i77655
lexfile: noun.food
part of speech: noun
hypernym: 07945759-n