legume-n
type: LexicalEntry
canonical form: legume
sense: 07724543-n
part of speech: noun

07724543-n
type: LexicalConcept
in scheme: en-word.net
definition: the seedpod of a leguminous plant (such as peas or beans or lentils)
ili: i77507
lexfile: noun.food
part of speech: noun
hypernym: 07723196-n
mero substance: 14752903-n