muffin-n
type: LexicalEntry
canonical form: muffin
sense: 07706018-n
part of speech: noun

gem-n
type: LexicalEntry
canonical form: gem
sense: 07706018-n
part of speech: noun

07706018-n
type: LexicalConcept
in scheme: en-word.net
definition: a sweet quick bread baked in a cup-shaped pan
ili: i77385
lexfile: noun.food
part of speech: noun
hypernym: 07700345-n