tripe-n
type: LexicalEntry
canonical form: tripe
sense: 07678965-n
part of speech: noun

07678965-n
type: LexicalConcept
in scheme: en-word.net
definition: lining of the stomach of a ruminant (especially a bovine) used as food
ili: i77194
lexfile: noun.food
part of speech: noun
hypernym: 07667063-n