brownie-n
type: LexicalEntry
canonical form: brownie
sense: 07651880-n
part of speech: noun

07651880-n
type: LexicalConcept
in scheme: en-word.net
definition: square or bar of very rich chocolate cake usually with nuts
ili: i77001
lexfile: noun.food
part of speech: noun
hypernym: 07650764-n