mint-n
type: LexicalEntry
canonical form: mint
sense: 07621887-n
part of speech: noun

mint candy-n
type: LexicalEntry
canonical form: mint candy
sense: 07621887-n
part of speech: noun

07621887-n
type: LexicalConcept
in scheme: en-word.net
definition: a candy that is flavored with a mint oil
ili: i76780
lexfile: noun.food
part of speech: noun
hypernym: 07612936-n
mero substance: 07835142-n