soup-n
type: LexicalEntry
canonical form: soup
sense: 07598762-n
part of speech: noun

07598762-n
type: LexicalConcept
in scheme: en-word.net
definition: liquid food especially of meat or fish or vegetable stock often containing pieces of solid food
ili: i76617
lexfile: noun.food
part of speech: noun
hypernym: 07572999-n