supper-n
type: LexicalEntry
canonical form: supper
sense: 07591549-n
part of speech: noun

07591549-n
type: LexicalConcept
in scheme: en-word.net
definition: a light evening meal; served in early evening if dinner is at midday or served late in the evening at bedtime
ili: i76572
lexfile: noun.food
part of speech: noun
hypernym: 07589261-n