dinner-n
type: LexicalEntry
canonical form: dinner
sense: 07591291-n
part of speech: noun

07591291-n
type: LexicalConcept
in scheme: en-word.net
definition: the main meal of the day served in the evening or at midday
example: dinner will be at 8
example: on Sundays they had a large dinner when they returned from church
ili: i76571
lexfile: noun.food
part of speech: noun
hypernym: 07589261-n