breadstuff-n
type: LexicalEntry
canonical form: breadstuff
sense: 07582604-n
part of speech: noun

07582604-n
type: LexicalConcept
in scheme: en-word.net
definition: flour or meal or grain used in baking bread
ili: i76517
lexfile: noun.food
part of speech: noun
hypernym: 07581905-n