buoyancy-n
type: LexicalEntry
canonical form: buoyancy
sense: 07546111-n
part of speech: noun

perkiness-n
type: LexicalEntry
canonical form: perkiness
sense: 07546111-n
part of speech: noun

07546111-n
type: LexicalConcept
in scheme: en-word.net
definition: cheerfulness that bubbles to the surface
ili: i76328
lexfile: noun.feeling
part of speech: noun
hypernym: 07545866-n