intoxication-n
type: LexicalEntry
canonical form: intoxication
sense: 07544195-n
part of speech: noun

07544195-n
type: LexicalConcept
in scheme: en-word.net
definition: excitement and elation beyond the bounds of sobriety
example: the intoxication of wealth and power
ili: i76316
lexfile: noun.feeling
part of speech: noun
hypernym: 07543600-n