admiration-n
type: LexicalEntry
canonical form: admiration
sense: 07515980-n
part of speech: noun

esteem-n
type: LexicalEntry
canonical form: esteem
sense: 07515980-n
part of speech: noun

07515980-n
type: LexicalConcept
in scheme: en-word.net
definition: a feeling of delighted approval and liking
ili: i76161
lexfile: noun.feeling
part of speech: noun
hypernym: 07512613-n