approval-n
type: LexicalEntry
canonical form: approval
sense: 07515398-n
part of speech: noun

07515398-n
type: LexicalConcept
in scheme: en-word.net
definition: a feeling of liking something or someone good
example: although she fussed at them, she secretly viewed all her children with approval
ili: i76158
lexfile: noun.feeling
part of speech: noun
hypernym: 07512613-n