delight-n
type: LexicalEntry
canonical form: delight
sense: 07506178-n
part of speech: noun

delectation-n
type: LexicalEntry
canonical form: delectation
sense: 07506178-n
part of speech: noun

07506178-n
type: LexicalConcept
in scheme: en-word.net
definition: a feeling of extreme pleasure or satisfaction
example: his delight to see her was obvious to all
ili: i76107
lexfile: noun.feeling
part of speech: noun
hypernym: 07505853-n