pleasure-n
type: LexicalEntry
canonical form: pleasure
sense: 07505853-n
part of speech: noun

pleasance-n
type: LexicalEntry
canonical form: pleasance
sense: 07505853-n
part of speech: noun

07505853-n
type: LexicalConcept
in scheme: en-word.net
definition: a fundamental feeling that is hard to define but that people desire to experience
example: he was tingling with pleasure
ili: i76106
lexfile: noun.feeling
part of speech: noun
hypernym: 00026390-n