desire-n
type: LexicalEntry
canonical form: desire
sense: 07499405-n
part of speech: noun

07499405-n
type: LexicalConcept
in scheme: en-word.net
definition: the feeling that accompanies an unsatisfied state
ili: i76067
lexfile: noun.feeling
part of speech: noun
hypernym: 00026390-n