wildness-n
type: LexicalEntry
canonical form: wildness
sense: 07496363-n
part of speech: noun

abandon-n
type: LexicalEntry
canonical form: abandon
sense: 07496363-n
part of speech: noun

07496363-n
type: LexicalConcept
in scheme: en-word.net
definition: a feeling of extreme emotional intensity
example: the wildness of his anger
ili: i76050
lexfile: noun.feeling
part of speech: noun
hypernym: 07496036-n