crash-n
type: LexicalEntry
canonical form: crash
sense: 07493085-n
part of speech: noun

collapse-n
type: LexicalEntry
canonical form: collapse
sense: 07493085-n
part of speech: noun

07493085-n
type: LexicalConcept
in scheme: en-word.net
definition: a sudden large decline of business or the prices of stocks (especially one that causes additional failures)
ili: i76031
lexfile: noun.event
part of speech: noun
hypernym: 07298313-n