trial-n
type: LexicalEntry
canonical form: trial
sense: 07492371-n
part of speech: noun

07492371-n
type: LexicalConcept
in scheme: en-word.net
definition: (sports) a preliminary competition to determine qualifications
example: the trials for the semifinals began yesterday
ili: i76028
lexfile: noun.event
part of speech: noun
domain topic: 00524569-n
hypernym: 07470961-n