slam-n
type: LexicalEntry
canonical form: slam
sense: 07489785-n
part of speech: noun

sweep-n
type: LexicalEntry
canonical form: sweep
sense: 07489785-n
part of speech: noun

07489785-n
type: LexicalConcept
in scheme: en-word.net
definition: winning all or all but one of the tricks in bridge
ili: i76010
lexfile: noun.event
part of speech: noun
hypernym: 07488581-n