joust-n
type: LexicalEntry
canonical form: joust
sense: 07487600-n
part of speech: noun

tilt-n
type: LexicalEntry
canonical form: tilt
sense: 07487600-n
part of speech: noun

07487600-n
type: LexicalConcept
in scheme: en-word.net
definition: a combat between two mounted knights tilting against each other with blunted lances
ili: i75999
lexfile: noun.event
part of speech: noun
hypernym: 00790634-n