series-n
type: LexicalEntry
canonical form: series
sense: 07480588-n
part of speech: noun

07480588-n
type: LexicalConcept
in scheme: en-word.net
definition: (sports) several contests played successively by the same teams
example: the visiting team swept the series
ili: i75955
lexfile: noun.event
part of speech: noun
domain topic: 00524569-n
hypernym: 07470961-n