English-n
type: LexicalEntry
canonical form: English
sense: 07457169-n
part of speech: noun

side-n
type: LexicalEntry
canonical form: side
sense: 07457169-n
part of speech: noun

07457169-n
type: LexicalConcept
in scheme: en-word.net
definition: (sports) the spin given to a ball by striking it on one side or releasing it with a sharp twist
ili: i75823
lexfile: noun.event
part of speech: noun
domain topic: 00524569-n
hypernym: 07456888-n