spin-n
type: LexicalEntry
canonical form: spin
sense: 07456888-n
part of speech: noun

07456888-n
type: LexicalConcept
in scheme: en-word.net
definition: a swift whirling motion (usually of a missile)
ili: i75821
lexfile: noun.event
part of speech: noun
hypernym: 07455579-n