precipitation-n
type: LexicalEntry
canonical form: precipitation
sense: 07448920-n
part of speech: noun

07448920-n
type: LexicalConcept
in scheme: en-word.net
definition: the act of casting down or falling headlong from a height
ili: i75782
lexfile: noun.event
part of speech: noun
hypernym: 07376986-n