climax-n
type: LexicalEntry
canonical form: climax
sense: 07431643-n
part of speech: noun

flood tide-n
type: LexicalEntry
canonical form: flood tide
sense: 07431643-n
part of speech: noun

07431643-n
type: LexicalConcept
in scheme: en-word.net
definition: the highest point of anything conceived of as growing or developing or unfolding
example: the climax of the artist's career
example: in the flood tide of his success
ili: i75689
lexfile: noun.event
part of speech: noun
domain topic: 00845915-n
hypernym: 07431314-n