current-n
type: LexicalEntry
canonical form: current
sense: 07421365-n
part of speech: noun

stream-n
type: LexicalEntry
canonical form: stream
sense: 07421365-n
part of speech: noun

07421365-n
type: LexicalConcept
in scheme: en-word.net
definition: a steady flow of a fluid (usually from natural causes)
example: the raft floated downstream on the current
example: he felt a stream of air
example: the hose ejected a stream of water
ili: i75630
lexfile: noun.event
part of speech: noun
hypernym: 07420493-n