flow-n
type: LexicalEntry
canonical form: flow
sense: 07420493-n
part of speech: noun

flowing-n
type: LexicalEntry
canonical form: flowing
sense: 07420493-n
part of speech: noun

07420493-n
type: LexicalConcept
in scheme: en-word.net
definition: the motion characteristic of fluids (liquids or gases)
ili: i75626
lexfile: noun.event
part of speech: noun
hypernym: 07325733-n