noise-n
type: LexicalEntry
canonical form: noise
sense: 07402109-n
part of speech: noun

07402109-n
type: LexicalConcept
in scheme: en-word.net
definition: sound of any kind (especially unintelligible or dissonant sound)
example: he enjoyed the street noises
example: they heard indistinct noises of people talking
example: during the firework display that ended the gala the noise reached 98 decibels
ili: i75520
lexfile: noun.event
part of speech: noun
hypernym: 07385893-n