takeoff-n
type: LexicalEntry
canonical form: takeoff
sense: 07390235-n
part of speech: noun

07390235-n
type: LexicalConcept
in scheme: en-word.net
definition: the initial ascent of an airplane as it becomes airborne
ili: i75447
lexfile: noun.event
part of speech: noun
hypernym: 07460080-n