heave-n
type: LexicalEntry
canonical form: heave
sense: 07385568-n
part of speech: noun

heaving-n
type: LexicalEntry
canonical form: heaving
sense: 07385568-n
part of speech: noun

07385568-n
type: LexicalConcept
in scheme: en-word.net
definition: an upward movement (especially a rhythmical rising and falling)
example: the heaving of waves on a rough sea
ili: i75429
lexfile: noun.event
part of speech: noun
hypernym: 07460080-n