transition-n
type: LexicalEntry
canonical form: transition
sense: 07373176-n
part of speech: noun

07373176-n
type: LexicalConcept
in scheme: en-word.net
definition: a change from one place or state or subject or stage to another
ili: i75361
lexfile: noun.event
part of speech: noun
hypernym: 07311046-n