wave-n
type: LexicalEntry
canonical form: wave
sense: 07360193-n
part of speech: noun

undulation-n
type: LexicalEntry
canonical form: undulation
sense: 07360193-n
part of speech: noun

07360193-n
type: LexicalConcept
in scheme: en-word.net
definition: (physics) a movement up and down or back and forth
ili: i75294
lexfile: noun.event
part of speech: noun
domain topic: 06100457-n
hypernym: 07324399-n