wrack-n
type: LexicalEntry
canonical form: wrack
sense: 07350181-n
part of speech: noun

rack-n
type: LexicalEntry
canonical form: rack
sense: 07350181-n
part of speech: noun

07350181-n
type: LexicalConcept
in scheme: en-word.net
definition: the destruction or collapse of something
example: wrack and ruin
ili: i75241
lexfile: noun.event
part of speech: noun
hypernym: 07349090-n