failure-n
type: LexicalEntry
canonical form: failure
sense: 07332364-n
part of speech: noun

07332364-n
type: LexicalConcept
in scheme: en-word.net
definition: an event that does not accomplish its intended purpose
example: the surprise party was a complete failure
ili: i75145
lexfile: noun.event
part of speech: noun
hypernym: 07298313-n