approach-n
type: LexicalEntry
canonical form: approach
sense: 07325125-n
part of speech: noun

approaching-n
type: LexicalEntry
canonical form: approaching
sense: 07325125-n
part of speech: noun

07325125-n
type: LexicalConcept
in scheme: en-word.net
definition: the event of one object coming closer to another
ili: i75108
lexfile: noun.event
part of speech: noun
hypernym: 07324399-n