collision-n
type: LexicalEntry
canonical form: collision
sense: 07316161-n
part of speech: noun

07316161-n
type: LexicalConcept
in scheme: en-word.net
definition: an accident resulting from violent impact of a moving object
example: three passengers were killed in the collision
example: the collision of the two ships resulted in a serious oil spill
ili: i75058
lexfile: noun.event
part of speech: noun
hypernym: 07315954-n