accident-n
type: LexicalEntry
canonical form: accident
sense: 07315954-n
part of speech: noun

07315954-n
type: LexicalConcept
in scheme: en-word.net
definition: an unfortunate mishap; especially one causing damage or injury
ili: i75057
lexfile: noun.event
part of speech: noun
hypernym: 07329027-n