mutation-n
type: LexicalEntry
canonical form: mutation
sense: 07312429-n
part of speech: noun

07312429-n
type: LexicalConcept
in scheme: en-word.net
definition: a change or alteration in form or qualities
ili: i75039
lexfile: noun.event
part of speech: noun
hypernym: 07311046-n