feast-n
type: LexicalEntry
canonical form: feast
sense: 07304867-n
part of speech: noun

07304867-n
type: LexicalConcept
in scheme: en-word.net
definition: something experienced with great delight
example: a feast for the eyes
ili: i75001
lexfile: noun.event
part of speech: noun
hypernym: 07304554-n