packet-n
type: LexicalEntry
canonical form: packet
sense: 07295804-n
part of speech: noun

07295804-n
type: LexicalConcept
in scheme: en-word.net
definition: (computer science) a message or message fragment
ili: i74954
lexfile: noun.communication
part of speech: noun
domain topic: 06138021-n
hypernym: 06263820-n